{"text_format":"1","workbook":"xlsx","n_sheets":11,"sheets":["Instructions","Calculator Questions","Sheet1","Processing Alternatives","Option1-off site use","Option2-Offsite Treatment","Option3-Worm Farm","Option4-Dehydration","Option5-In Vessel composting","Option6-Anaerobic digester","Data"],"not_rendered":{"charts":0,"images":2,"macros":1,"external_links":0,"defined_names":62,"comments":0,"pivot_tables":0},"unopened":[],"bounds":{"document_bytes":16777216,"sheet_cells":100000,"rows_first":2000,"rows_last":500,"rows_between":2000,"halvings":0,"cell_chars":16384,"cell_head_chars":4096},"cells_cut":0,"cells_raw":0,"read":"whole","date_system":"1900"}

{"sheet":"Instructions","index":0,"n_rows":89,"n_cols":13,"rows_kept":89,"cut":false,"hidden":false,"merged":[]}
[]
[null,null,"Food Waste Calculator"]
[]
[null,null,"Instructions"]
[null,null,"This Food Waste Calculator will help you to determine the key parameters"]
[null,null,"in deciding the options to handle Food Waste in your business. To start"]
[null,null,"you need to go to the sheet called Calculator Questions and the macro"]
[null,null,"buttons will lead you through a series of interactive questions to assemble"]
[null,null,"the information to make a decision on the various options available to you.",null,null,null,null,null,null,null,null,"This project was funded through the Victorian Government's"]
[null,null,"The first section is the questions to ascertain the amount of food waste, cost",null,null,null,null,null,null,null,null,"Metropolitan Organics Strategy Fund "]
[null,null,"of food waste and method of disposal. The second section looks at the various "]
[null,null,"alternatives to process this food waste."]
[null,null,null,null,null,null,null,null,null,null,null,"Version No:",2]
[null,null,null,null,null,null,null,null,null,null,null,"Version Date:","2016-12-16"]
[null,null,"To start the Food Waste Calculator, simply push this macro button below."]
[null,null,"This file contains macros so make sure you have enabled macros as the file "]
[null,null,"loads. If you haven't, do so now. If your not sure how to:",null,null,null,null,null,"Press for HELP"]
[]
[]
[]
[null,null,"Warning: If you have used this Food Waste Calculator before it will erase"]
[null,null,"the old information to allow a new set of data to be entered."]
[]
[null,null,"If you want to start again retaining the original data but step through again, "]
[null,null,"then simply go to the sheet called Calculator Questions and press the 1st "]
[null,null,"Next button."]
[]
[null,null,"If you damage the food Waste Calculator then simply download another"]
[null,null,"copy."]
[]
{"$rows_left_out":60}
{"sheet":"Calculator Questions","index":1,"n_rows":324,"n_cols":15,"rows_kept":324,"cut":false,"hidden":false,"merged":[[9,1,9,6],[13,1,13,6],[17,1,17,6],[22,1,22,6],[63,1,63,6],[19,1,19,6],[50,1,50,6],[43,1,43,6],[44,3,44,7],[305,6,305,7],[306,6,306,7],[125,1,125,6],[5,1,5,6],[11,1,11,6],[7,1,7,6],[39,1,39,6],[121,1,121,6],[81,1,81,6],[85,1,85,6],[100,1,100,6],[101,1,101,6],[111,3,111,6],[64,1,64,6],[9,7,9,12],[15,1,15,6]]}
[null,"Food Waste Calculator Questions"]
[null,"1st Section - Answering the basic questions below will assist you in determining what method "]
[null,"is appropriate to dispose of your food waste. It captures the amount of food waste and cost to "]
[null,"dispose of it. Fill in any blue numbers."]
[null,null,null,null,null,null,null,"Response",null,null,null,null,null,"YES","NO"]
["Q. 1","Do you generate Food Waste in your organisation?",null,null,null,null,null,null,null,null,null,null,"Q1","If Yes to Q2","Stops"]
[]
["No Response","As you do not generate any food waste in your organisation this calculator does not apply to you. You do not need to proceed any further."]
[]
["Q. 3",null,null,null,null,null,null,null,null,null,null,null,"Q2","If Yes to Q3","Stops"]
[]
["No Response","As you do not want to remove the food waste from landfill this calculator does not apply to you. You do not need to proceed any further."]
["Q4"]
[null,"Do you currently separate the Food Waste from the General Waste?",null,null,null,null,null,null,null,null,null,null,"Q3","If Yes to Q4","If No to Q20"]
[null,null,null,null,null,null,null,null,null,null,null,null,"Separates Food Waste"]
[null,"Do you know the weight of the Food Waste in Kgs per week?",null,null,null,null,null,null,null,null,null,null,"Q4","If Yes to Q5","If No to Q12"]
[]
[null,"Please enter the weight of the Food Waste in Kgs in a typical  week",null,null,null,null,null,null,"Kgs",null,null,null,"Q5","When entered goto Q6"]
[]
[null,"How is the food waste currently disposed of?",null,null,null,null,null,null,null,null,null,null,"Q6","If Contractor to Q7"]
[null,null,null,null,null,null,null,null,null,null,null,null,null,"If General Waste Q7"]
[null,null,null,null,null,null,null,null,null,null,null,null,null,"If Treated on site Q8"]
[null,"Known Food Waste Weight- We now need to calculate the cost to dispose of this Food Waste. Fill out the table below.",null,null,null,null,null,null,null,null,null,null,"Q7","When updated goto Q8"]
[null,null,null,null,null,null,null,"Bins per mth"]
[null,null,null,"No of bins of Food Waste emptied per month",null,null,null,0,null,null,null,null,null,"}"]
[null,null,null,"Average Size of bins",null,null,null,"80 litres",null,null,null,null,null,"}"]
[null,null,null,"Number on bins hired on site",null,null,null,0]
[null,null,null,"Cost per bin per collection",null,null,null,0,null,null,null,null,null,"}"]
[null,null,null,"Per Bin rental per mth",null,null,null,0,null,null,null,null,null,"} Know Weight"]
[null,null,null,"On average how full is the bins?",null,null,null,0,null,null,null,null,null,"}"]
{"$rows_left_out":295}
{"sheet":"Sheet1","index":2,"n_rows":9,"n_cols":6,"rows_kept":9,"cut":false,"hidden":true,"merged":[]}
[]
[]
[]
[null,null,null,null,null,"NO - hide from rows 10 down"]
[]
[]
[null,"Yes"]
[]
[null,null,null,null,null,"NO - hide from rows 14 down"]

{"sheet":"Processing Alternatives","index":3,"n_rows":112,"n_cols":14,"rows_kept":112,"cut":false,"hidden":true,"merged":[[19,0,19,5],[24,0,24,7],[31,0,31,9],[89,6,89,8],[40,6,40,8],[50,6,50,8],[61,6,61,8],[80,6,80,8],[71,6,71,8]]}
["Food Waste Processing Alternatives"]
[]
["There are a number of processing alternatives as follows to process your Food Waste."]
["Currently you generate this amount of Food Waste -->",null,null,null,null,{"$f":"+'Calculator Questions'!G303","v":"No Answer"},"kgs per week"]
[null,null,null,null,"           -->",{"$f":"+F4/7","v":{"$error":"#VALUE!"}},"kgs per day"]
[]
[null,"Options for processing Food Waste",null,null,null,"Space Required on site",null,"Required Staff Hrs per day",null,"Minimum Capital spend required","Space Available","Staff Available","Capital Spend","Overall Evaluation"]
[null,"Option 1 - Off Site Use (eg Food Charity)",null,null,null,"None",null,0,null,0,{"$f":"IF(Option_Q1=\"\",\"\",\"OK\")","v":""},{"$f":"IF(option_Q2=\"\",\"\",\"OK\")","v":""},{"$f":"IF(Option_Q3=\"\",\"\",\"OK\")","v":""},{"$f":"IF(OR(K8=\"\",L8=\"\",M8=\"\"),\"\",IF(AND(K8=\"OK\",L8=\"OK\",M8=\"OK\"),\"OK\",\"NO\"))","v":""}]
[null,"Option 2 - Off Site Processing",null,null,null,"None",null,0,null,0,{"$f":"IF(Option_Q1=\"\",\"\",\"OK\")","v":""},{"$f":"IF(option_Q2=\"\",\"\",\"OK\")","v":""},{"$f":"IF(Option_Q3=\"\",\"\",\"OK\")","v":""},{"$f":"IF(OR(K9=\"\",L9=\"\",M9=\"\"),\"\",IF(AND(K9=\"OK\",L9=\"OK\",M9=\"OK\"),\"OK\",\"NO\"))","v":""}]
[null,"Option 3 - Worm farm (on site)",null,null,null,{"$f":"IF($F$5<60,ROUNDUP(+$F5/2,0)*'Option3-Worm Farm'!$I21,ROUNDUP($F5/60,0)*'Option3-Worm Farm'!$I22)","v":{"$error":"#VALUE!"}},"m2",{"$f":"IF($F$5<60,ROUNDUP(+$F5/2,0)*'Option3-Worm Farm'!$H21,ROUNDUP($F5/60,0)*'Option3-Worm Farm'!$H22)/60","v":{"$error":"#VALUE!"}},"hrs",{"$f":"+'Option3-Worm Farm'!G66","v":{"$error":"#VALUE!"}},{"$f":"IF(Option_Q1=\"\",\"\",IF(Option_Q1>=$F10,\"OK\",\"No\"))","v":""},{"$f":"IF(option_Q2=\"\",\"\",IF(option_Q2>=$H10,\"OK\",\"No\"))","v":""},{"$f":"IF(Option_Q3=\"\",\"\",IF(Option_Q3>=$J10,\"OK\",\"No\"))","v":""},""]
[null,"Option 4 - Dehydration Unit",null,null,null,{"$f":"VLOOKUP('Option4-Dehydration'!$D27,'Option4-Dehydration'!$A$20:$I$24,9)","v":{"$error":"#VALUE!"}},"m2",{"$f":"IF('Option4-Dehydration'!G16<0.5*VLOOKUP('Option4-Dehydration'!$D27,'Option4-Dehydration'!$A$20:$I$24,1),VLOOKUP('Option4-Dehydration'!$D27,'Option4-Dehydration'!$A$20:$I$24,8)/60*1,VLOOKUP('Option4-Dehydration'!$D27,'Option4-Dehydration'!$A$20:$I$24,8)/60*2)","v":{"$error":"#VALUE!"}},"hrs",{"$f":"+'Option4-Dehydration'!G66","v":{"$error":"#VALUE!"}},{"$f":"IF(Option_Q1=\"\",\"\",IF(Option_Q1>=F11,\"OK\",\"No\"))","v":""},{"$f":"IF(option_Q2=\"\",\"\",IF(option_Q2>=$H11,\"OK\",\"No\"))","v":""},{"$f":"IF(Option_Q3=\"\",\"\",IF(Option_Q3>=$J11,\"OK\",\"No\"))","v":""},""]
[null,"Option 5 - In Vessel composting",null,null,null,{"$f":"VLOOKUP('Option5-In Vessel composting'!D24,'Option5-In Vessel composting'!$A$20:$I$21,8,FALSE)","v":{"$error":"#VALUE!"}},"m2",{"$f":"VLOOKUP('Option5-In Vessel composting'!D24,'Option5-In Vessel composting'!$A$20:$H$21,7,FALSE)/60","v":{"$error":"#VALUE!"}},"hrs",{"$f":"+'Option5-In Vessel composting'!G63","v":{"$error":"#VALUE!"}},{"$f":"IF(Option_Q1=\"\",\"\",IF(Option_Q1>=F12,\"OK\",\"No\"))","v":""},{"$f":"IF(option_Q2=\"\",\"\",IF(option_Q2>=$H12,\"OK\",\"No\"))","v":""},{"$f":"IF(Option_Q3=\"\",\"\",IF(Option_Q3>=$J12,\"OK\",\"No\"))","v":""},""]
[null,"Option 6 - Anaerobic digester",null,null,null,{"$f":"VLOOKUP('Option6-Anaerobic digester'!D24,'Option6-Anaerobic digester'!A20:H21,8,FALSE)","v":{"$error":"#VALUE!"}},"m2",{"$f":"VLOOKUP('Option6-Anaerobic digester'!D24,'Option6-Anaerobic digester'!$A$20:$H$21,7,FALSE)","v":{"$error":"#VALUE!"}},"hrs",{"$f":"+'Option6-Anaerobic digester'!G64","v":{"$error":"#VALUE!"}},{"$f":"IF(Option_Q1=\"\",\"\",IF(Option_Q1>=F13,\"OK\",\"No\"))","v":""},{"$f":"IF(option_Q2=\"\",\"\",IF(option_Q2>=$H13,\"OK\",\"No\"))","v":""},{"$f":"IF(Option_Q3=\"\",\"\",IF(Option_Q3>=$J13,\"OK\",\"No\"))","v":""},""]
[]
["Some of these may not apply so we are going to eliminate the ones that don't"]
["apply to you based on your answers to the previous questions about Food Waste "]
["and the couple of simple questions below:"]
[]
[]
["How much space do you have available for onsite processing?"]
["If none then enter 0.",null,null,null,null,null,"m2"]
[]
[]
[]
["How many hours are you prepared to spend for onsite processing per day?"]
["You may have a limitation on the hours that your existing staff can handle  for on site "]
["processing. Therefore this question can exclude options where staff are already"]
["fully engaged in other activities."]
[null,null,null,null,null,null,"Hrs"]
[]
{"$rows_left_out":83}
{"sheet":"Option1-off site use","index":4,"n_rows":70,"n_cols":8,"rows_kept":70,"cut":false,"hidden":true,"merged":[[58,0,58,1],[59,0,59,1],[23,6,23,7]]}
["Option 1: Off Site Use"]
["e.g. Food Charity donation - Edible food for human consumption"]
[]
["This option requires the separation of good quality edible food for human consumption. "]
["This alternative has great social and environmental gains as you are not wasting good"]
["food. See the accompanying Guide which provides some practical examples of how you "]
["could undertake this."]
[]
[]
["To make an informed decision the Calculator Questions produced the following"]
["information to assist you:"]
[]
["Estimated Food Waste Produced per month in kgs",null,null,null,null,null,{"$f":"+'Calculator Questions'!$H$303/12","v":{"$error":"#VALUE!"}},"kgs"]
["Estimated Food Waste Produced per month in cubic metres",null,null,null,null,null,{"$f":"+'Calculator Questions'!$H$304/12","v":{"$error":"#VALUE!"}},"cubic metres"]
["Estimated cost going to landfill per month for food waste",null,null,null,null,null,{"$f":"+'Calculator Questions'!$H$305/12","v":{"$error":"#VALUE!"}}]
[]
["Parentage of your Food Waste that is good quality edible food "]
["for donation to charities",null,null,null,null,null,0.4,"You enter"]
["All items in blue you enter your estimate. The black numbers are formulas."]
[]
["Note some large charities have a minimum of 50kg pick up policy."]
["Refer to the accompanying Guide for more information on this."]
["Requirements:",null,null,null,"Minimum pickups in kgs","Your daily food Waste kgs"]
[" - Minimum Food Pick",null,null,null,"50 kgs",{"$f":"(G13*G18)/30","v":{"$error":"#VALUE!"}},{"$f":"IF(F24>E24,\"You could have daily pickups\",\"You will need to store the food between pickups\")","v":{"$error":"#VALUE!"}}]
[]
["Benefits: ","No capital expenditure"]
[null,"Good food not wasted but given to someone in need"]
[null,"Great social and environment benefits"]
[]
["Cons:","Will take only food donations for human consumption not food scraps"]
{"$rows_left_out":41}
{"sheet":"Option2-Offsite Treatment","index":5,"n_rows":63,"n_cols":8,"rows_kept":63,"cut":false,"hidden":true,"merged":[[52,0,52,1],[51,0,51,1]]}
["Option 2: Off Site Treatment"]
["e.g. Go to commercial operators (composting, worm farm, etc.)"]
[]
["This option requires the separation of food waste from general waste on site and can be "]
["picked up by commercial operators. It allows you to gain good environmental benefits of "]
["eliminating food waste from landfill. The accompanying Guide provides some practical  "]
["explanation of how you could undertake this option."]
[]
[]
["To make an informed decision the Calculator Questions produced the following"]
["information to assist you:"]
[]
["Estimated Food Waste Produced per month in kgs",null,null,null,null,null,{"$f":"+'Calculator Questions'!$H$303/12","v":{"$error":"#VALUE!"}},"kgs"]
["Estimated Food Waste Produced per month in cubic metres",null,null,null,null,null,{"$f":"+'Calculator Questions'!$H$304/12","v":{"$error":"#VALUE!"}},"cubic metres"]
["Estimated cost going to landfill per month for food waste",null,null,null,null,null,{"$f":"+'Calculator Questions'!$H$305/12","v":{"$error":"#VALUE!"}}]
["Estimated number of bins being used for Food Waste ",null,null,null,null,null,{"$f":"+'Calculator Questions'!G309","v":"No Answer"},"bins each mth"]
[]
["Benefits: ","No capital expenditure"]
[null,"Food Waste removed from landfill"]
[null,"Doesn't require as much space as Options 3 to 6"]
[null,"Simple solution to get good environmental benefits"]
[]
["Cons:","Will need to separate food waste"]
[null,"Will cost to dispose of food waste, but it costs to dispose of"]
[null,"in landfill so unlikely to cost much more."]
[]
["Refer to the accompanying Guide for a full analysis of this option."]
[]
["Template to Calculate Impact"]
["All items in blue you enter your estimate. The black numbers are formulas."]
{"$rows_left_out":34}
{"sheet":"Option3-Worm Farm","index":6,"n_rows":82,"n_cols":9,"rows_kept":82,"cut":false,"hidden":true,"merged":[[71,0,71,1],[72,0,72,1],[25,3,25,5]]}
["Option 3: Worm Farm (on site)"]
[]
[]
["This option still requires the separation of food waste from general waste on site but then  "]
["put into the onsite worm farm. It allows you to gain the environmental benefits of eliminating "]
["food waste from landfill but also providing you with usable organic material. Worm farms"]
["range form small home-scale systems to much bigger commercial type systems."]
["The accompanying Guide provides some practical knowledge of how you could undertake this "]
["and how the system works."]
["To make an informed decision the Calculator Questions produced the following"]
["information to assist you:"]
[]
["Estimated Food Waste Produced per month in kgs",null,null,null,null,null,{"$f":"+'Calculator Questions'!$H$303/12","v":{"$error":"#VALUE!"}},"kgs"]
["Estimated Food Waste Produced per month in cubic metres",null,null,null,null,null,{"$f":"+'Calculator Questions'!$H$304/12","v":{"$error":"#VALUE!"}},"cubic metres"]
["Estimated cost going to landfill per month for food waste",null,null,null,null,null,{"$f":"+'Calculator Questions'!$H$305/12","v":{"$error":"#VALUE!"}}]
["Estimated daily Food Waste Produced in kgs",null,null,null,null,null,{"$f":"+G13/30","v":{"$error":"#VALUE!"}},"kgs"]
[]
["Example of sizes and approximate costs of worm farm systems available are as follows:"]
["The 2kg size is the typical home unit but a number of these can be connected."]
["Unit Size","Unit weight","Unit Size",null,"Max Daily  food waste kgs","Cost","Number of units you require","Labour minutes per day","sq metres floor area"]
["2 kgs/day","12kgs","60cm x 65cm x 95cm",null,2,395,{"$f":"ROUNDUP(+$G$16/E21,0)","v":{"$error":"#VALUE!"}},5,{"$f":"0.6*0.65","v":0.39}]
["60 kgs/day","150 kgs","3m x 2m x 2.5m",null,60,21500,{"$f":"ROUNDUP(+$G$16/E22,0)","v":{"$error":"#VALUE!"}},20,{"$f":"3*2","v":6}]
["** Note: costs quoted above are based on 2015 prices at an AUD/USD rate of $0.70 "]
[]
[null,null,null,null,null,null,"No of Units "]
[" - You choose likely system",null,null,"2 kgs/day",null,null,{"$f":"IF(ISNA(VLOOKUP(D26,$A$21:$G$22,7,FALSE))=TRUE,0,VLOOKUP(D26,$A$21:$G$22,7,FALSE))","v":{"$error":"#VALUE!"}}]
[]
[]
["Benefits: ","Organic Material available on site for gardens, etc from the system"]
[null,"Relatively low cost"]
{"$rows_left_out":53}
{"sheet":"Option4-Dehydration","index":7,"n_rows":84,"n_cols":15,"rows_kept":84,"cut":false,"hidden":true,"merged":[[73,0,73,1],[74,0,74,1]]}
["Option 4: Dehydration unit"]
[]
["This option still requires the separation of food waste from general waste on site but then  "]
["put into a dehydration unit to reduce the weight and size of the waste. You still have to "]
["dispose of the output that is good for composts and gardens. Dehydration units use gas"]
["or electricity and dehydrate the food waste. Typically a reduction of 90% can be achieved."]
["The accompanying Guide provides some knowledge of how this process works and its "]
["requirements."]
[]
["To make an informed decision the Calculator Questions produced the following"]
["information to assist you:"]
[]
["Estimated Food Waste Produced per month in kgs",null,null,null,null,null,{"$f":"+'Calculator Questions'!$H$303/12","v":{"$error":"#VALUE!"}},"kgs"]
["Estimated Food Waste Produced per month in cubic metres",null,null,null,null,null,{"$f":"+'Calculator Questions'!$H$304/12","v":{"$error":"#VALUE!"}},"cub. metres"]
["Estimated cost going to landfill per month for food waste",null,null,null,null,null,{"$f":"+'Calculator Questions'!$H$305/12","v":{"$error":"#VALUE!"}}]
["Estimated daily Food Waste Produced in kgs",null,null,null,null,null,{"$f":"+G13/30","v":{"$error":"#VALUE!"}},"kgs"]
[]
["There are a variety of sized systems available. Examples are as follows:"]
["Unit Size kgs/ day based on 2 cycles per day","Cycles possible per day","Unit footprint",null,"Max Daily  food waste kgs","Capital Cost","Electricity cost per cycle","Labour minutes per cycle","sq metres floor area",null,null,null,null,"kgs of waste","Machine size"]
[50,2,"65cm x 65cm x 90cm",null,{"$f":"+A20","v":50},27000,4,15,{"$f":"0.65*0.65","v":0.42250000000000004},null,null,null,null,0,50]
[100,2,"95cm x 140cm x 120cm",null,{"$f":"+A21","v":100},40000,6,20,{"$f":"0.95*1.4","v":1.3299999999999998},null,null,null,null,50,50]
[400,2,"150cm x 260cm x 180cm",null,{"$f":"+A22","v":400},110000,24,25,{"$f":"1.5*2.6","v":3.9000000000000004},null,null,null,null,51,100]
[600,2,"165cm x 260cm x180cm",null,{"$f":"+A23","v":600},155000,33.75,25,{"$f":"1.65*2.6","v":4.29},null,null,null,null,100,100]
[1200,2,"180cm x 330cm x 220cm",null,{"$f":"+A24","v":1200},220000,67.5,30,{"$f":"1.8*3.3","v":5.9399999999999995},null,null,null,null,101,400]
["** Note: costs quoted above are based on 2015 prices at an AUD/USD rate of $0.70 ",null,null,null,null,null,null,null,null,null,null,null,null,400,400]
[null,null,null,null,null,null,null,null,null,null,null,null,null,401,600]
[" - Your likely system",null,null,{"$f":"VLOOKUP(G16,$N$20:$O$28,2,TRUE)","v":{"$error":"#VALUE!"}},"kgs/ day that can do 2 cycles per day",null,null,null,null,null,null,null,null,600,600]
["Requirements:",null,null,null,null,null,null,null,null,null,null,null,null,601,1200]
[" - 3 Phase power ",null,null,null," - Possibly need to flue for air"]
[" - Discharge water to trade waste",null,null,null," - Space for unit"]
{"$rows_left_out":55}
{"sheet":"Option5-In Vessel composting","index":8,"n_rows":82,"n_cols":12,"rows_kept":82,"cut":false,"hidden":true,"merged":[[70,0,70,1],[71,0,71,1]]}
["Option 5: In Vessel Composting"]
[]
["This option still requires the separation of food waste from general waste on site but then  "]
["put into an In Vessel Composting unit to reduce the weight and size of the waste. The in "]
["vessel composting speeds up the decomposition. You still have to dispose of the output."]
["Some systems produce compost and others produce a mixture called \"soil conditioner\"."]
["The accompanying Guide provides some knowledge of how this process works and its "]
["requirements."]
[]
["To make an informed decision the Calculator Questions produced the following"]
["information to assist you:"]
[]
["Estimated Food Waste Produced per month in kgs",null,null,null,null,null,{"$f":"+'Calculator Questions'!$H$303/12","v":{"$error":"#VALUE!"}},"kgs"]
["Estimated Food Waste Produced per month in cubic metres",null,null,null,null,null,{"$f":"+'Calculator Questions'!$H$304/12","v":{"$error":"#VALUE!"}},"cub. metres"]
["Estimated cost going to landfill per month for food waste",null,null,null,null,null,{"$f":"+'Calculator Questions'!$H$305/12","v":{"$error":"#VALUE!"}}]
["Estimated daily Food Waste Produced in kgs",null,null,null,null,null,{"$f":"+G13/30","v":{"$error":"#VALUE!"}},"kgs"]
[]
["There are a variety of sized systems available. Examples are as follows:"]
["Unit Size kg /day","Unit footprint",null,"Power require- ment","Capital Cost","Electricity cost per batch","Labour minutes per batch","sq metres floor area"]
[85,"5.5m x 1.3m x 1.8m",null,"240 volt",9900,1.4,35,{"$f":"5.5*1.3","v":7.15},null,null,0,{"$f":"+A20","v":85}]
[6400,"12.8m x 2.1m x 1.8m",null,"3 Phase",380000,10,70,{"$f":"12.8*2.1","v":26.880000000000003},null,null,85,85]
["** Note: costs quoted above are based on 2015 prices at an AUD/USD rate of $0.70 ",null,null,null,null,null,null,null,null,null,86,6400]
[]
[" - Your likely system",null,null,{"$f":"VLOOKUP($G$16,$K$20:$L$22,2,TRUE)","v":{"$error":"#VALUE!"}},"kgs per day"]
[]
["Requirements:"]
[" - May require 3 Phase power "]
[" - Space for unit"]
[]
["Benefits: ","Food Waste removed from landfill"]
{"$rows_left_out":53}
{"sheet":"Option6-Anaerobic digester","index":9,"n_rows":82,"n_cols":12,"rows_kept":82,"cut":false,"hidden":true,"merged":[[70,0,70,1],[71,0,71,1]]}
["Option 6: Anaerobic Digestion"]
[]
["This option still requires the separation of food waste from general waste on site but then  "]
["put into an Anaerobic Digestion unit to reduce the weight and size of the waste. You still "]
["have to dispose of the output. Anaerobic Digestion uses micro organisms to break down"]
["biodegradable material to manage waste and/or generate energy. Generally this process"]
["is only used in very large scale facilities because of the capital cost."]
["The accompanying Guide provides some knowledge of how this process works and its "]
["requirements."]
["To make an informed decision the Calculator Questions produced the following"]
["information to assist you:"]
[]
["Estimated Food Waste Produced per month in kgs",null,null,null,null,null,{"$f":"+'Calculator Questions'!$H$303/12","v":{"$error":"#VALUE!"}},"kgs"]
["Estimated Food Waste Produced per month in cubic metres",null,null,null,null,null,{"$f":"+'Calculator Questions'!$H$304/12","v":{"$error":"#VALUE!"}},"cub. metres"]
["Estimated cost going to landfill per month for food waste",null,null,null,null,null,{"$f":"+'Calculator Questions'!$H$305/12","v":{"$error":"#VALUE!"}}]
["Estimated daily Food Waste Produced in kgs",null,null,null,null,null,{"$f":"+G13/30","v":{"$error":"#VALUE!"}},"kgs"]
[]
["There are not many examples in Australia. An indication of cost and size is as follows:"]
["Unit Size kg /day","Unit footprint","Power",null,"Capital Cost","Electricity cost per batch","Labour  Hours per batch","sq metres floor area"]
[1000,"200m2","Electricity or Gas",null,450000,5,3.8,200,null,null,0,{"$f":"+A20","v":1000}]
[55000,"3,500m2","Electricity or Gas",null,5750000,{"$f":"200000/365","v":547.94520547945206},7.6,3500,null,null,{"$f":"+A20","v":1000},1000]
[null,null,null,null,null,null,null,null,null,null,1001,55000]
[]
[" - Your likely system",null,null,{"$f":"VLOOKUP(G16,$K$20:$L$22,2,TRUE)","v":{"$error":"#VALUE!"}},"kgs per day"]
[]
["Requirements:"]
[" - 3 Phase power or Gas"]
[" - Space for unit"]
[]
["Benefits: ","Food Waste removed from landfill"]
{"$rows_left_out":53}
{"sheet":"Data","index":10,"n_rows":28,"n_cols":4,"rows_kept":28,"cut":false,"hidden":true,"merged":[[3,0,3,3]]}
["Data Required"]
[]
[]
["Q11 Bin Sizes"]
[null,"Bin Size","Litres","Cubic Metres"]
[null,"80 litres",80,{"$f":"+C6*0.001","v":0.08}]
[null,"120 litres",120,{"$f":"+C7*0.001","v":0.12}]
[null,"240 litres",240,0.24]
[null,"660 litres",660,0.66]
[null,"Front lift 1.5m3",1500,1.5]
[null,"Front lift 3.0m3",3000,3]
[null,"Front Lift 4.5m3",4500,4.5]
[]
[]
[]
[null,"1 litre = 0.001 cubic metres"]
[]
[]
[null,"Food waste","1m3 = 400kg"]
[null,null,"0.25m3 = 100kg"]
[]
[]
[null,"Food Waste Types"]
[null,"Food scraps from plates"]
[null,"Vegetable peelings"]
[null,"Fruit & Vegetables"]
[null,"Dense food scraps"]
[null,"All of the above"]