{"text_format":"1","workbook":"xlsx","n_sheets":10,"sheets":["Instructions","Your Details","Single Line  Data Entry","Bulk Data Entry","CSV Data and Data Submission","DataBase","Waste Types","Conversion Factors","Facility Information","Version Control"],"not_rendered":{"charts":0,"images":20,"macros":1,"external_links":0,"defined_names":19,"comments":0,"pivot_tables":0},"unopened":[],"bounds":{"document_bytes":16777216,"sheet_cells":100000,"rows_first":2000,"rows_last":500,"rows_between":2000,"halvings":0,"cell_chars":16384,"cell_head_chars":4096},"cells_cut":0,"cells_raw":0,"read":"whole","date_system":"1900"}

{"sheet":"Instructions","index":0,"n_rows":99,"n_cols":3,"rows_kept":99,"cut":false,"hidden":false,"merged":[]}
[]
[]
[]
[null,"1. Purpose"]
[null,1.1000000000000001,"This worksheet has been developed to enable Victorian Health Services to collect and analyse waste data in a consistent manner. "]
[null,1.2,"This worksheet is intended solely for use by Victorian Health Services. "]
[]
[null,"2. General Information"]
[null,2.1,"General"]
[null,"a.","All Data Entry Fields are Mandatory unless Marked Optional"]
[null,"b.","Majority of data entry is via drop-down menus. Simply click on the cell in which data is to be entered and a box with a down arrow will appear.  Click on this and a list will appear.  Scroll down and select from this list by clicking. "]
[]
[null,2.2000000000000002,"Health Service Details"]
[null,"a","The name of the Health Service must be entered on the front page ( \"Cover Sheet\") and will saved for future use.  The user's name is also required to make an initial (the fist letter of first, middle and last names) for the data entry system."]
[]
[null,2.2999999999999998,"Health Service Waste Data"]
[null,"a","Health Services can enter data  via the \"Single Line Data Entry\"  tab or via the \"Bulk Data Entry\" tool."]
[]
[null,"3. Data Entry"]
[null,3.1,"Create Records with \"Single Line Data Entry\" Tool"]
[null,null,"Service and billing Period Details. Health service data can be selected via the use of dropdown lists, or by using the search panes."]
[null,null,"·  Service  Selection via the use of dropdown lists."]
[null,null,"        ·   Click on field to prompt list, select list using dropdown indicator"]
[null,null,"        ·   Scroll to find your health service and select using mouse"]
[null,null,"·   Site data selection via the use of dropdown lists."]
[null,null,"    ·   Click on field to prompt list, select list using dropdown indicator"]
[null,null,"    ·   Scroll to find your site and select using mouse"]
[null,null,"·  Service or Site  Selection via the use of search."]
[null,null,"    ·   Click on the search button to bring up the search pane"]
[null,null,"    ·   Enter a search term in the Service Name field"]
{"$rows_left_out":70}
{"sheet":"Your Details","index":1,"n_rows":29,"n_cols":13,"rows_kept":29,"cut":false,"hidden":false,"merged":[[1,2,1,16],[25,5,25,8],[16,4,16,5],[18,4,18,5],[20,4,20,5],[12,2,12,5],[13,8,13,10],[22,2,24,7],[19,8,19,14],[17,12,17,14]]}
["0003"]
[null,null,"Victorian Public Healthcare Services Waste Reporting Tool"]
[]
[]
[]
[]
[]
[]
[null,"Your Details"]
[]
[]
[null,null,"Your Health Service:"]
[null,null,"Albury Wodonga Health",null,null,null,{"$f":"IF(ISBLANK(C13),0,1)","v":1}]
[null,null,null,null,null,null,null,null,null,null,null,null,"DHHS Contact:"]
[null,null,null,null,null,null,null,null,null,null,null,null,"Tiernan Humphrys"]
[null,null,null,null,null,null,null,null,null,null,null,null,"Manager Environmental Sustainability"]
[null,null,null,"Your First Name","a",null,null,null,null,null,null,null,"p. 03 9096 2057"]
[null,null,null,null,null,null,null,null,null,null,null,null,"sustainability@dhhs.vic.gov.au"]
[null,null,null,"Your Middle Name","b"]
[null,null,null,null,null,null,null,null,"Data is Submitted  to the DHHS via the CSV Data & Data Submission Tab"]
[null,null,null,"Your Surname","c"]
[]
[null,null,"Your name is used to make a unique identifier for the file that you will send to the Database.  The Unique identifier is constructed from the first letter of each name.  Your name will not be shared directly "]
[]
[]
[]
[]
[]
[null,false]

{"sheet":"Single Line  Data Entry","index":2,"n_rows":31,"n_cols":21,"rows_kept":31,"cut":false,"hidden":false,"merged":[[18,10,18,11],[22,10,22,11],[22,13,22,14],[1,2,1,16],[22,7,22,8],[14,8,14,9],[14,2,14,6],[22,3,22,5],[12,2,12,4],[12,7,12,9],[18,4,18,5],[18,7,18,8],[9,1,9,2]]}
["0136"]
[null,null,"Victorian Public Healthcare Services Waste Reporting Tool"]
[]
[]
[]
[]
[]
[]
[]
[null,"Waste Data Entry -",null,{"$f":"LEFT('Your Details'!E17,1)&LEFT('Your Details'!E19,1)&LEFT('Your Details'!E21,1)","v":"abc"},null,null,null,null,null,null,null,null,null,null,null,null,null,{"$f":"IF(ISBLANK('Your Details'!C13),C13,'Your Details'!C13)","v":"Albury Wodonga Health"}]
[]
[null,null,"Service Name",null,null,null,null,"Site Name",null,null,null,null,"Period Start",null,null,"Period End"]
[null,null,"Ambulance Victoria",null,null,null,null,null,null,null,{"$f":"IF(ISBLANK(C13),0,(COUNTIF(OFFSET(DataBase!$C$1,MATCH(C13,DataBase!$C:$C,0)-1,1,COUNTIF(DataBase!$C:$C,C13),1),H13)))","v":0},null,{"$f":"TEXT(\"01/\"&MONTH(TODAY()-30)&\"/\"&YEAR(TODAY()-30),\"dd/mm/yyyy\")","v":"01/03/2018"},1,null,{"$f":"TEXT(\"28/\"&MONTH(TODAY()-30)&\"/\"&YEAR(TODAY()-30),\"dd/mm/yyyy\")","v":"28/03/2018"},1]
[null,null,"Address",null,null,null,null,null,"GLN"]
[null,null,{"$f":"VLOOKUP(H13,DataBase!D:F,3,FALSE)","v":{"$error":"#N/A"}},null,null,null,null,null,{"$f":"VLOOKUP($H$13,DataBase!D:F,2,FALSE)","v":{"$error":"#N/A"}}]
[]
[]
[null,null,null,null,"Waste Category",null,null,"Waste Sub Type",null,null,"Unit of Measure"]
[null,null,null,null,null,null,null,null,null,null,null,null,{"$f":"IF(H19 = \"Please Select\",0,(COUNTIF(OFFSET('Waste Types'!$C:$C,MATCH(E19,'Waste Types'!$C:$C,0)-1,1,COUNTIF('Waste Types'!$C:$C,E19),1),H19)))","v":{"$error":"#N/A"}}]
[null,null,null,null,null,null,null,"density:",{"$f":"IF(H19=\"\",0,VLOOKUP(H19,'Waste Types'!D:E,2,FALSE))","v":0},null,"m3:",{"$f":"IF(K19 = \"Please Select\",0,VLOOKUP(K19,'Conversion Factors'!$A:$F,3,FALSE))","v":{"$error":"#N/A"}},"UOM",{"$f":"IF(K19 = \"Please Select\",0,VLOOKUP(K19,'Waste Types'!$J:$K,2,FALSE))","v":{"$error":"#N/A"}}]
[null,null,null,null,null,null,null,{"$f":"H19","v":0},null,null,"fullness Factor",{"$f":"VLOOKUP(K19,'Conversion Factors'!$A:$F,5,FALSE)","v":{"$error":"#N/A"}}]
[null,null,null,"Vendor",null,null,null,"Invoice Number",null,null,"Quantity",null,null,"Cost Ex GST"]
[null,null,null,null,null,null,{"$f":"IF(ISBLANK(D23),0,1)","v":0},null,null,{"$f":"IF(ISBLANK(H23),0,1)","v":0},null,null,{"$f":"IF(ISBLANK(K23),0,1)","v":0},null,null,{"$f":"IF(ISBLANK(N23),0,1)","v":0}]
[null,null,null,null,null,"(Optional)",null,null,"(Optional)",null,"kg",{"$f":"K23*L20*I20","v":{"$error":"#N/A"}}]
[]
[]
[]
[]
[]
["GLN","Data Provider Classification","Service Provider","Invoice Number","Customer Name","Site Name","Site Address","Waste Stream","Period Start Date","Period End Date","Period Days","Bin Name","Bin Count/Quantity","Bin Count/Quantity UOM","Bin Volume","Bin Volume UOM","Bin Conversion Factor Density","Bin Conversion Factor Density UOM","Bin Conversion Factor Fullness","Nett Weight of Waste(kg)","Cost(ex GST)"]
{"$rows_left_out":2}
{"sheet":"Bulk Data Entry","index":3,"n_rows":5,"n_cols":22,"rows_kept":5,"cut":false,"hidden":false,"merged":[]}
[]
[null,null,"Victorian Public Healthcare Services Waste Reporting Tool"]
[1,2,3,4,5,6,7,8,9,10,11,12,13,14,15,16,17,18,19,20,21,22]
[]
[null,"GLN","Period Start","Period End","Waste Category","Waste Sub Type","Unit of Measure","QTY","Invoice Number","Vendor","COST"]

{"sheet":"CSV Data and Data Submission","index":4,"n_rows":0,"n_cols":0,"rows_kept":0,"cut":false,"hidden":false,"merged":[]}

{"sheet":"DataBase","index":5,"n_rows":202,"n_cols":6,"rows_kept":202,"cut":false,"hidden":false,"merged":[]}
["Service Names",null,"Campus Names (Service/Campus - SERVICE)","Campus Names (Service/Campus - CAMPUS)","GLN","Address"]
["Please Select",null,"Please Select","Please Select","Please Select","Please Select"]
["Albury Wodonga Health",null,"Albury Wodonga Health","Albury Hospital",1000000000024,"4 Watson St WODONGA"]
["Alexandra District Hospital",null,"Albury Wodonga Health","Wodonga Hospital",1000000000025,"53-81 Vermont St, WODONGA"]
["Alfred Health",null,"Alexandra District Hospital","Alexandra District Hospital",9339626000004,"24 Cooper Street ALEXANDRA"]
["Alpine Health",null,"Alfred Health","Caulfield Hospital",9339626005375,"260-292 Kooyong Road CAULFIELD"]
["Ambulance Victoria",null,"Alfred Health","Sandringham Hospital",9339626005382,"193 Bluff Road SANDRINGHAM"]
["Austin Health",null,"Alfred Health","The Alfred Hospital",9339626005368,"55 Commercial Road MELBOURNE"]
["Bairnsdale Regional Health Service",null,"Alfred Health","Alfred Health - unallocated data",9339626000165]
["Ballarat Health Services",null,"Alpine Health","Bright Hospital",9339626000301,"32-36 Cobden Street BRIGHT"]
["Barwon Health",null,"Alpine Health","Hawthorn Village Hostel",1000000000054,"1 Rotary Drive BRIGHT"]
["Bass Coast Health",null,"Alpine Health","Mount Beauty Hospital",9339626001179,"Service entrance Tawonga Crescent MOUNT BEAUTY"]
["Beaufort and Skipton Health Service",null,"Alpine Health","Myrtleford Hospital",9339626001209,"Service entrance Standish Street MYRTLEFORD"]
["Beechworth Health Service",null,"Ambulance Victoria","Ambulance Victoria",9339626007225,"375 Manningham Road DONCASTER"]
["Benalla Health",null,"Austin Health","Austin Health satellite sites",1000000000001,""]
["Bendigo Health",null,"Austin Health","Austin Hospital",9339626000042,"145 Studley Road HEIDELBERG"]
["Boort District Health",null,"Austin Health","Heidelberg Repatriation Hospital",9339626000790,"300 Waterdale Road HEIDELBERG HEIGHTS"]
["Calvery Health Care Bethlehem",null,"Austin Health","Royal Talbot Rehabilitation Centre",9339626001490,"1 Yarra Boulevard KEW"]
["Casterton Memorial Hospital",null,"Austin Health","Austin Health - unallocated data",9377778609652]
["Castlemaine Health",null,"Bairnsdale Regional Health Service","Bairnsdale Regional Health Service",9339626000066,"122 Day Street BAIRNSDALE"]
["Central Gippsland Health Service",null,"Ballarat Health Services","Ballarat Base Hospital",9339626006327,"Drummond Street BALLARAT"]
["Cobram District Health",null,"Ballarat Health Services","Dental 53 Herford St",1000000000044,"53 Hertoford St Sebastopol"]
["Cohuna District Health",null,"Ballarat Health Services","Eastern View Psych Centre",1000000000050,"40 Stawell St Ballarat"]
["Colac Area Health",null,"Ballarat Health Services","Eureka Complex",1000000000045,"Balmoral Drive Ballarat (159 Kenny St Ballarat)"]
["Dental Health Services Victoria",null,"Ballarat Health Services","Eureka Linen",1000000000047,"Lonsdale St Ballarat"]
["Djerriwarrh Health Services",null,"Ballarat Health Services","Eyres House",1000000000048,"810 Ligar St Ballarat"]
["East Grampians Health Service",null,"Ballarat Health Services","GICS 804 Sturt St",1000000000051,"804 Sturt St Ballarat"]
["East Wimmera Health Service",null,"Ballarat Health Services","Midlands Complex",1000000000046,"701-703 Norman St Ballarat"]
["Eastern Health",null,"Ballarat Health Services","Pleasant Homes Mother Baby Unit",1000000000049,"28-34 Pleasant St South Ballarat"]
["Echuca Regional Health",null,"Ballarat Health Services","Queen Elizabeth Campus",9339626000073,"102 Ascot Street South BALLARAT"]
{"$rows_left_out":173}
{"sheet":"Waste Types","index":6,"n_rows":180,"n_cols":11,"rows_kept":180,"cut":false,"hidden":false,"merged":[]}
[]
["Waste Type UID",null,"Broad Activity Group","Broad Activity","Density kg/m3",null,"EDMS Activity",null,"Waste Sub Type","EDMS Bin Name","UOM"]
["Clinical waste",null,"Clinical waste","Anatomical",227,null,"Clinical waste Anatomical",null,"Clinical wasteAnatomical","kg","kg"]
["General waste",null,"Clinical waste","Clinical waste",227,null,"Clinical waste Clinical waste",null,"Clinical wasteAnatomical","Laprosmart L64 (count)","ea"]
["Recycling",null,"Clinical waste","Cytotoxic",227,null,"Clinical waste Cytotoxic",null,"Clinical wasteAnatomical","L64 delivery fee","ea"]
["Secure documents",null,"Clinical waste","Pharmaceutical",227,null,"Clinical waste Pharmaceutical",null,"Clinical wasteClinical waste","kg","kg"]
["Liquid waste",null,"Clinical waste","Quarantine",227,null,"Clinical waste Quarantine",null,"Clinical wasteClinical waste","Clinismart C64 (count)","ea"]
[null,null,"Clinical waste","Sharps",227,null,"Clinical waste Sharps",null,"Clinical wasteClinical waste","C64 delivery fee","ea"]
[null,null,"General waste","Bins",115,null,"General waste Bins",null,"Clinical wasteCytotoxic","kg","kg"]
[null,null,"General waste","Compactor",348,null,"General waste Compactor",null,"Clinical wasteCytotoxic","Cytosmart CY64 (count)","ea"]
[null,null,"General waste","Continence aids",170,null,"General waste Continence aids",null,"Clinical wasteCytotoxic","CY64 delivery fee","ea"]
[null,null,"General waste","Enviropoles - butt bins",170,null,"General waste Enviropoles - butt bins",null,"Clinical wastePharmaceutical","kg","kg"]
[null,null,"General waste","Hygiene waste",170,null,"General waste Hygiene waste",null,"Clinical wastePharmaceutical","Pharmasmart P64 (count)","ea"]
[null,null,"General waste","Nappy disposal",170,null,"General waste Nappy disposal",null,"Clinical wastePharmaceutical","P64 delivery fee","ea"]
[null,null,"General waste","Sanitary waste",87,null,"General waste Sanitary waste",null,"Clinical wasteQuarantine","kg","kg"]
[null,null,"General waste","Skips",87,null,"General waste Skips",null,"Clinical wasteSharps","kg","kg"]
[null,null,"Liquid waste","Grease traps",950,null,"Liquid waste Grease traps",null,"Clinical wasteSharps","Sharpsmart S14 (count)","ea"]
[null,null,"Recycling","Batteries",900,null,"Recycling Batteries",null,"Clinical wasteSharps","Sharpsmart S22 (count)","ea"]
[null,null,"Recycling","Cardboard",55,null,"Recycling Cardboard",null,"Clinical wasteSharps","Sharpsmart S32 (count)","ea"]
[null,null,"Recycling","Commingled",110,null,"Recycling Commingled",null,"Clinical wasteSharps","S14 delivery fee","ea"]
[null,null,"Recycling","E-waste",230,null,"Recycling E-waste",null,"Clinical wasteSharps","S22 delivery fee","ea"]
[null,null,"Recycling","Fluorescent tubes",285,null,"Recycling Fluorescent tubes",null,"Clinical wasteSharps","S32 delivery fee","kg"]
[null,null,"Recycling","Mattresses",50,null,"Recycling Mattresses",null,"General wasteBins","kg","kg"]
[null,null,"Recycling","Metals",120,null,"Recycling Metals",null,"General wasteBins","120L MGB (count)","ea"]
[null,null,"Recycling","Mixed paper/cardboard",131,null,"Recycling Mixed paper/cardboard",null,"General wasteBins","240L MGB (count)","ea"]
[null,null,"Recycling","Mobile phones",230,null,"Recycling Mobile phones",null,"General wasteBins","660L MGB (count)","ea"]
[null,null,"Recycling","Organics - food waste",350,null,"Recycling Organics - food waste",null,"General wasteBins","1100L MGB (count)","ea"]
[null,null,"Recycling","Organics - green waste",91,null,"Recycling Organics - green waste",null,"General wasteCompactor","kg","kg"]
[null,null,"Recycling","other plastics",78,null,"Recycling Other plastics",null,"General wasteCompactor","Service fee","ea"]
[null,null,"Recycling","Paper",228,null,"Recycling Paper",null,"General wasteContinence aids","kg","kg"]
{"$rows_left_out":151}
{"sheet":"Conversion Factors","index":7,"n_rows":44,"n_cols":5,"rows_kept":44,"cut":false,"hidden":false,"merged":[]}
["     Unit","Unit of Measure (UOM)","Volume (m3)","Unit Mass per Item (Kg)","Fullness Factor"]
["kg","kg",1,1,1]
["20L Pail (count)","ea",0.02,0,0.8]
["60L MGB (count)","ea",0.06,0,0.8]
["120L MGB (count)","ea",0.12,0,0.8]
["240L MGB (count)","ea",0.24,0,0.8]
["660L MGB (count)","ea",0.66,0,0.8]
["1100L MGB (count)","ea",1.1000000000000001,0,0.8]
["Clinismart C64 (count)","ea",5.5E-2,0,0.6]
["Cytosmart CY64 (count)","ea",5.5E-2,0,0.6]
["Laprosmart L64 (count)","ea",5.5E-2,0,0.6]
["Pharmasmart P64 (count)","ea",5.5E-2,0,0.6]
["Sharpsmart S14 (count)","ea",6.4999999999999997E-3,0,0.8]
["Sharpsmart S22 (count)","ea",1.4500000000000001E-2,0,0.8]
["Sharpsmart S32 (count)","ea",2.35E-2,0,0.8]
["C64 delivery fee","ea",0,0,0]
["CY64 delivery fee","ea",0,0,0]
["L64 delivery fee","ea",0,0,0]
["P64 delivery fee","ea",0,0,0]
["S14 delivery fee","ea",0,0,0]
["S22 delivery fee","ea",0,0,0]
["S32 delivery fee","ea",0,0,0]
["1.5 m³ skip (count)","ea",1.5,0,1]
["2.25 m³ skip (count)","ea",2.25,0,1]
["3 m³ skip (count)","ea",3,0,1]
["4.5 m³ skip (count)","ea",4.5,0,1]
["6 m³ skip (count)","ea",6,0,1]
["Enviropoles (count)","ea",1.2E-2,0,0.8]
["Sanipods (count)","ea",1.2E-2,0,0.8]
["1 m³ bulkbag (count)","ea",1,0,1]
{"$rows_left_out":15}
{"sheet":"Facility Information","index":8,"n_rows":2186,"n_cols":4,"rows_kept":2186,"cut":false,"hidden":false,"merged":[]}
["Service","Campus","GLN","Address"]
[{"$f":"DataBase!C3","v":"Albury Wodonga Health"},{"$f":"DataBase!D3","v":"Albury Hospital"},{"$f":"DataBase!E3","v":1000000000024},{"$f":"DataBase!F3","v":"4 Watson St WODONGA"}]
[{"$f":"DataBase!C5","v":"Alexandra District Hospital"},{"$f":"DataBase!D5","v":"Alexandra District Hospital"},{"$f":"DataBase!E5","v":9339626000004},{"$f":"DataBase!F5","v":"24 Cooper Street ALEXANDRA"}]
[{"$f":"DataBase!C6","v":"Alfred Health"},{"$f":"DataBase!D6","v":"Caulfield Hospital"},{"$f":"DataBase!E6","v":9339626005375},{"$f":"DataBase!F6","v":"260-292 Kooyong Road CAULFIELD"}]
[{"$f":"DataBase!C7","v":"Alfred Health"},{"$f":"DataBase!D7","v":"Sandringham Hospital"},{"$f":"DataBase!E7","v":9339626005382},{"$f":"DataBase!F7","v":"193 Bluff Road SANDRINGHAM"}]
[{"$f":"DataBase!C8","v":"Alfred Health"},{"$f":"DataBase!D8","v":"The Alfred Hospital"},{"$f":"DataBase!E8","v":9339626005368},{"$f":"DataBase!F8","v":"55 Commercial Road MELBOURNE"}]
[{"$f":"DataBase!C9","v":"Alfred Health"},{"$f":"DataBase!D9","v":"Alfred Health - unallocated data"},{"$f":"DataBase!E9","v":9339626000165},{"$f":"DataBase!F9","v":0}]
[{"$f":"DataBase!C10","v":"Alpine Health"},{"$f":"DataBase!D10","v":"Bright Hospital"},{"$f":"DataBase!E10","v":9339626000301},{"$f":"DataBase!F10","v":"32-36 Cobden Street BRIGHT"}]
[{"$f":"DataBase!C11","v":"Alpine Health"},{"$f":"DataBase!D11","v":"Hawthorn Village Hostel"},{"$f":"DataBase!E11","v":1000000000054},{"$f":"DataBase!F11","v":"1 Rotary Drive BRIGHT"}]
[{"$f":"DataBase!C12","v":"Alpine Health"},{"$f":"DataBase!D12","v":"Mount Beauty Hospital"},{"$f":"DataBase!E12","v":9339626001179},{"$f":"DataBase!F12","v":"Service entrance Tawonga Crescent MOUNT BEAUTY"}]
[{"$f":"DataBase!C13","v":"Alpine Health"},{"$f":"DataBase!D13","v":"Myrtleford Hospital"},{"$f":"DataBase!E13","v":9339626001209},{"$f":"DataBase!F13","v":"Service entrance Standish Street MYRTLEFORD"}]
[{"$f":"DataBase!C14","v":"Ambulance Victoria"},{"$f":"DataBase!D14","v":"Ambulance Victoria"},{"$f":"DataBase!E14","v":9339626007225},{"$f":"DataBase!F14","v":"375 Manningham Road DONCASTER"}]
[{"$f":"DataBase!C15","v":"Austin Health"},{"$f":"DataBase!D15","v":"Austin Health satellite sites"},{"$f":"DataBase!E15","v":1000000000001},{"$f":"DataBase!F15","v":""}]
[{"$f":"DataBase!C16","v":"Austin Health"},{"$f":"DataBase!D16","v":"Austin Hospital"},{"$f":"DataBase!E16","v":9339626000042},{"$f":"DataBase!F16","v":"145 Studley Road HEIDELBERG"}]
[{"$f":"DataBase!C17","v":"Austin Health"},{"$f":"DataBase!D17","v":"Heidelberg Repatriation Hospital"},{"$f":"DataBase!E17","v":9339626000790},{"$f":"DataBase!F17","v":"300 Waterdale Road HEIDELBERG HEIGHTS"}]
[{"$f":"DataBase!C18","v":"Austin Health"},{"$f":"DataBase!D18","v":"Royal Talbot Rehabilitation Centre"},{"$f":"DataBase!E18","v":9339626001490},{"$f":"DataBase!F18","v":"1 Yarra Boulevard KEW"}]
[{"$f":"DataBase!C19","v":"Austin Health"},{"$f":"DataBase!D19","v":"Austin Health - unallocated data"},{"$f":"DataBase!E19","v":9377778609652},{"$f":"DataBase!F19","v":0}]
[{"$f":"DataBase!C20","v":"Bairnsdale Regional Health Service"},{"$f":"DataBase!D20","v":"Bairnsdale Regional Health Service"},{"$f":"DataBase!E20","v":9339626000066},{"$f":"DataBase!F20","v":"122 Day Street BAIRNSDALE"}]
[{"$f":"DataBase!C21","v":"Ballarat Health Services"},{"$f":"DataBase!D21","v":"Ballarat Base Hospital"},{"$f":"DataBase!E21","v":9339626006327},{"$f":"DataBase!F21","v":"Drummond Street BALLARAT"}]
[{"$f":"DataBase!C22","v":"Ballarat Health Services"},{"$f":"DataBase!D22","v":"Dental 53 Herford St"},{"$f":"DataBase!E22","v":1000000000044},{"$f":"DataBase!F22","v":"53 Hertoford St Sebastopol"}]
[{"$f":"DataBase!C23","v":"Ballarat Health Services"},{"$f":"DataBase!D23","v":"Eastern View Psych Centre"},{"$f":"DataBase!E23","v":1000000000050},{"$f":"DataBase!F23","v":"40 Stawell St Ballarat"}]
[{"$f":"DataBase!C24","v":"Ballarat Health Services"},{"$f":"DataBase!D24","v":"Eureka Complex"},{"$f":"DataBase!E24","v":1000000000045},{"$f":"DataBase!F24","v":"Balmoral Drive Ballarat (159 Kenny St Ballarat)"}]
[{"$f":"DataBase!C25","v":"Ballarat Health Services"},{"$f":"DataBase!D25","v":"Eureka Linen"},{"$f":"DataBase!E25","v":1000000000047},{"$f":"DataBase!F25","v":"Lonsdale St Ballarat"}]
[{"$f":"DataBase!C26","v":"Ballarat Health Services"},{"$f":"DataBase!D26","v":"Eyres House"},{"$f":"DataBase!E26","v":1000000000048},{"$f":"DataBase!F26","v":"810 Ligar St Ballarat"}]
[{"$f":"DataBase!C27","v":"Ballarat Health Services"},{"$f":"DataBase!D27","v":"GICS 804 Sturt St"},{"$f":"DataBase!E27","v":1000000000051},{"$f":"DataBase!F27","v":"804 Sturt St Ballarat"}]
[{"$f":"DataBase!C28","v":"Ballarat Health Services"},{"$f":"DataBase!D28","v":"Midlands Complex"},{"$f":"DataBase!E28","v":1000000000046},{"$f":"DataBase!F28","v":"701-703 Norman St Ballarat"}]
[{"$f":"DataBase!C29","v":"Ballarat Health Services"},{"$f":"DataBase!D29","v":"Pleasant Homes Mother Baby Unit"},{"$f":"DataBase!E29","v":1000000000049},{"$f":"DataBase!F29","v":"28-34 Pleasant St South Ballarat"}]
[{"$f":"DataBase!C30","v":"Ballarat Health Services"},{"$f":"DataBase!D30","v":"Queen Elizabeth Campus"},{"$f":"DataBase!E30","v":9339626000073},{"$f":"DataBase!F30","v":"102 Ascot Street South BALLARAT"}]
[{"$f":"DataBase!C31","v":"Ballarat Health Services"},{"$f":"DataBase!D31","v":"Queen Elizabeth Village "},{"$f":"DataBase!E31","v":1000000000042},{"$f":"DataBase!F31","v":" Lot 2 Gillies St Wendouree"}]
[{"$f":"DataBase!C32","v":"Ballarat Health Services"},{"$f":"DataBase!D32","v":"safety Link 16 eastwood st "},{"$f":"DataBase!E32","v":1000000000052},{"$f":"DataBase!F32","v":"16 Eastwood St Ballarat"}]
{"$rows_left_out":2157}
{"sheet":"Version Control","index":9,"n_rows":20,"n_cols":5,"rows_kept":20,"cut":false,"hidden":false,"merged":[]}
[]
["Victorian Public Healthcare Services Waste Reporting Tool"]
[]
[]
["Change Log"]
[]
["Version ","Date","Description","Changed By","Reviewed By"]
[1,"2015-12-14","Waste Tool V1.00"]
[1.01,"2016-01-05","Health Service Name removed from file name structure at data provider request","AH","N/A"]
[1.02,"2016-02-01","Functionality to separate kg from QTY based measurements added","AH","JeH"]
[1.03,"2016-02-17","Refinements to Bulk upload tool","AH","JeH"]
[1.04,"2016-02-22","Removed N/A designation of empty fields at request of D.B. admin","AH"]
[1.1299999999999999,"2017-05-23","HPV updated DataBase (GLN map), Waste Types and Conversion Factors","JeH"]
[1.1399999999999999,"2017-06-26","HPV updated some Waste Types and Bin Names","JeH"]
[1.1499999999999999,"2017-08-04","changed date to text format in data submission tab to avoid excel reding date format incorrectly from other sheet","AH"]
[2.0099999999999998,"2017-08-28","Added a 'Custom Value' bin type so that the USER DEFINED option will work correctly","JeH"]
[2.02,"2017-09-21","Updated Database tab for an extra waste device at Northern Health - Bundoora Extended Care Centre","JeH"]
[2.0299999999999998,"2017-11-02","Updated Database tab for an extra waste device at Alpine Health - Hawthorne Village Hostel","JeH"]
[2.04,"2018-03-01","Updated Waste Types to enable more bin types","JeH"]
[2.0499999999999998,"2018-04-06","Updated Cohuna District Health and Calvary Health Care Bethlehelm","JeH"]